Target
Coagulation factor XI
Ligand
BDBM50136578
Substrate
Meas. Tech.
ChEMBL_1548350 (CHEMBL3756134)
Ki
3.4±n/a nM
Citation
 Smith, LMOrwat, MJHu, ZHan, WWang, CRossi, KAGilligan, PJPabbisetty, KBOsuna, HCorte, JRRendina, ARLuettgen, JMWong, PCNarayanan, RHarper, TWBozarth, JMCrain, EJWei, ARamamurthy, VMorin, PEXin, BZheng, JSeiffert, DAQuan, MLLam, PYWexler, RRPinto, DJ Novel phenylalanine derived diamides as Factor XIa inhibitors. Bioorg Med Chem Lett 26:472-8 (2016)  
Target
Name:
Coagulation factor XI
Synonyms:
Coagulation factor XIa Coagulation factor XIa light chain FA11_HUMAN Factor XIa PTA | Plasma thromboplastin antecedent
Type:
Enzyme
Mol. Mass.:
70130.58
Organism:
Homo sapiens (Human)
Description:
P03951
Residue:
625
  
Inhibitor
Name:
BDBM50136578
Synonyms:
CHEMBL3752066
Type:
Small organic molecule
Emp. Form.:
C27H26ClN7O4
Mol. Mass.:
547.993
SMILES:
COC(=O)Nc1ccc(cc1)C(=O)N[C@@H](Cc1ccccc1)C(=O)NCCc1cc(Cl)ccc1-n1cnnn1
: