Target
Prostaglandin E2 receptor EP2 subtype
Ligand
BDBM50138051
Substrate
Meas. Tech.
ChEMBL_1549761 (CHEMBL3757317)
EC50
2.9±n/a nM
Citation
 Kinoshita, AHigashino, MAratani, YKakuuchi, AMatsuya, HOhmoto, K Discovery of highly potent dual EP(2) and EP(3) agonists with subtype selectivity. Bioorg Med Chem Lett 26:1016-9 (2016)  
Target
Name:
Prostaglandin E2 receptor EP2 subtype
Synonyms:
PE2R2_HUMAN PTGER2 Prostaglandin E2 receptor Prostanoid EP2 Receptor
Type:
Enzyme
Mol. Mass.:
39775.71
Organism:
Homo sapiens (Human)
Description:
P43116
Residue:
358
  
Inhibitor
Name:
BDBM50138051
Synonyms:
CHEMBL3753221
Type:
Small organic molecule
Emp. Form.:
C20H28N2O5S2
Mol. Mass.:
440.577
SMILES:
CCCCC1(CCC1)[C@H](O)\C=C\[C@H]1COC(=O)N1CCSc1nc(cs1)C(O)=O
: