Target
Elastase
Ligand
BDBM50204382
Substrate
Meas. Tech.
ChEMBL_1550090 (CHEMBL3756036)
IC50
1900±n/a nM
Citation
 Sjøli, SNuti, ECamodeca, CBilto, IRossello, AWinberg, JOSylte, IAdekoya, OA Synthesis, experimental evaluation and molecular modelling of hydroxamate derivatives as zinc metalloproteinase inhibitors. Eur J Med Chem 108:141-53 (2016)  
Target
Name:
Elastase
Synonyms:
ELAS_PSEAE lasB
Type:
PROTEIN
Mol. Mass.:
53687.94
Organism:
Pseudomonas aeruginosa
Description:
ChEMBL_619859
Residue:
498
  
Inhibitor
Name:
BDBM50204382
Synonyms:
2-(benzyloxyamino)-N-hydroxyhexanamide | CHEMBL228230
Type:
Small organic molecule
Emp. Form.:
C13H20N2O3
Mol. Mass.:
252.3095
SMILES:
CCCCC(NOCc1ccccc1)C(=O)NO
: