Target
Elastase
Ligand
BDBM50161330
Substrate
Meas. Tech.
ChEMBL_1550090 (CHEMBL3756036)
IC50
798000±n/a nM
Citation
 Sjøli, SNuti, ECamodeca, CBilto, IRossello, AWinberg, JOSylte, IAdekoya, OA Synthesis, experimental evaluation and molecular modelling of hydroxamate derivatives as zinc metalloproteinase inhibitors. Eur J Med Chem 108:141-53 (2016)  
Target
Name:
Elastase
Synonyms:
ELAS_PSEAE lasB
Type:
PROTEIN
Mol. Mass.:
53687.94
Organism:
Pseudomonas aeruginosa
Description:
ChEMBL_619859
Residue:
498
  
Inhibitor
Name:
BDBM50161330
Synonyms:
(R)-2-[(Biphenyl-4-sulfonyl)-isopropoxy-amino]-N-hydroxy-3-methyl-butyramide CHEMBL179288
Type:
Small organic molecule
Emp. Form.:
C20H26N2O5S
Mol. Mass.:
406.496
SMILES:
CC(C)ON([C@H](C(C)C)C(=O)NO)S(=O)(=O)c1ccc(cc1)-c1ccccc1
: