Target
Neuronal acetylcholine receptor subunit alpha-7
Ligand
BDBM50140292
Substrate
Meas. Tech.
ChEBML_1552366
Ki
343±n/a nM
Citation
 Matera, CQuadri, MSciaccaluga, MPomè, DYFasoli, FDe Amici, MFucile, SGotti, CDallanoce, CGrazioso, G Modification of the anabaseine pyridine nucleus allows achieving binding and functional selectivity for thea3ß4 nicotinic acetylcholine receptor subtype. Eur J Med Chem 108:392-405 (2016)  
Target
Name:
Neuronal acetylcholine receptor subunit alpha-7
Synonyms:
ACHA7_RAT Cholinergic, Nicotinic Alpha7 Chrna7 Neuronal acetylcholine receptor (alpha7 nAChR) Neuronal acetylcholine receptor subunit alpha-7 Neuronal acetylcholine receptor subunit alpha-7 (nAChR)
Type:
Enzyme
Mol. Mass.:
56502.44
Organism:
Rattus norvegicus (Rat)
Description:
Q05941
Residue:
502
  
Inhibitor
Name:
BDBM50140292
Synonyms:
CHEMBL3759852
Type:
Small organic molecule
Emp. Form.:
C11H11Br2N
Mol. Mass.:
317.02
SMILES:
Brc1cc(Br)cc(c1)C1=NCCCC1
: