Target
Carbonic anhydrase 1
Ligand
BDBM50142631
Substrate
Meas. Tech.
ChEMBL_1551175 (CHEMBL3761623)
Ki
>50000±n/a nM
Citation
 Durgun, MTurkmen, HCeruso, MSupuran, CT Synthesis of 4-sulfamoylphenyl-benzylamine derivatives with inhibitory activity against human carbonic anhydrase isoforms I, II, IX and XII. Bioorg Med Chem 24:982-8 (2016)  
Target
Name:
Carbonic anhydrase 1
Synonyms:
CA-I CAB Carbonate dehydratase I Carbonic anhydrase 1 (CA I) Carbonic anhydrase 1 (Recombinant CA I) Carbonic anhydrase B Carbonic anhydrase I (CA I) Carbonic anhydrase I (CAI) Carbonic anhydrase isoenzyme I (hCA I) | hCA
Type:
Enzyme
Mol. Mass.:
28873.37
Organism:
Homo sapiens (Human)
Description:
P00915
Residue:
261
  
Inhibitor
Name:
BDBM50142631
Synonyms:
CHEMBL3758997
Type:
Small organic molecule
Emp. Form.:
C13H10Br2N2O3S
Mol. Mass.:
434.103
SMILES:
NS(=O)(=O)c1ccc(cc1)\N=C\c1cc(Br)cc(Br)c1O
: