Target
L-lactate dehydrogenase A chain
Ligand
BDBM50010448
Substrate
Meas. Tech.
ChEBML_1555230
Ki
2500±n/a nM
Citation
 Rani, RKumar, V Recent Update on Human Lactate Dehydrogenase Enzyme 5 (hLDH5) Inhibitors: A Promising Approach for Cancer Chemotherapy. J Med Chem 59:487-96 (2016)  
Target
Name:
L-lactate dehydrogenase A chain
Synonyms:
Cell proliferation-inducing gene 19 protein L-lactate dehydrogenase A Chain LDH-A LDHA Lactate dehydrogenase A (LDHA) | Renal carcinoma antigen NY-REN-59
Type:
Protein
Mol. Mass.:
36694.85
Organism:
Homo sapiens (Human)
Description:
P00338::PDB Code: 4ajp
Residue:
332
  
Inhibitor
Name:
BDBM50010448
Synonyms:
2,2'-Diimino-5,5'-diisopropyl-7,7'-dimethyl-2H,2'H-[8,8']bi[naphtho[1,8-bc]furanyl]-3,4,3',4'-tetraol | CHEMBL424250
Type:
Small organic molecule
Emp. Form.:
C30H28N2O6
Mol. Mass.:
512.5531
SMILES:
CC(C)c1c(O)c(O)c2C(=N)Oc3c(c(C)cc1c23)-c1c2OC(=N)c3c(O)c(O)c(C(C)C)c(cc1C)c23
: