Target
L-lactate dehydrogenase B chain
Ligand
BDBM50010438
Substrate
Meas. Tech.
ChEMBL_1555231 (CHEMBL3768757)
Ki
33000±n/a nM
Citation
 Rani, RKumar, V Recent Update on Human Lactate Dehydrogenase Enzyme 5 (hLDH5) Inhibitors: A Promising Approach for Cancer Chemotherapy. J Med Chem 59:487-96 (2016)  
Target
Name:
L-lactate dehydrogenase B chain
Synonyms:
L-lactate dehydrogenase B LDH heart subunit LDH-H LDHB_HUMAN Renal carcinoma antigen NY-REN-46
Type:
Oxidoreductase; homotetramer
Mol. Mass.:
36635.55
Organism:
Homo sapiens (Human)
Description:
Residue:
334
  
Inhibitor
Name:
BDBM50010438
Synonyms:
Acetic acid 1'-acetoxy-8,8'-dicyano-6,7,6',7'-tetrahydroxy-5,5'-diisopropyl-3,3'-dimethyl-[2,2']binaphthalenyl-1-yl ester | CHEMBL51778
Type:
Small organic molecule
Emp. Form.:
C34H32N2O8
Mol. Mass.:
596.6265
SMILES:
CC(C)c1c(O)c(O)c(C#N)c2c(OC(C)=O)c(c(C)cc12)-c1c(C)cc2c(C(C)C)c(O)c(O)c(C#N)c2c1OC(C)=O
: