Target
Vitamin D3 receptor
Ligand
BDBM21680
Substrate
Meas. Tech.
ChEMBL_1553657 (CHEMBL3766237)
IC50
>150000±n/a nM
Citation
 Teske, KABogart, JWSanchez, LMYu, OBPreston, JVCook, JMSilvaggi, NRBikle, DDArnold, LA Synthesis and evaluation of vitamin D receptor-mediated activities of cholesterol and vitamin D metabolites. Eur J Med Chem 109:238-46 (2016)  
Target
Name:
Vitamin D3 receptor
Synonyms:
1,25-dihydroxyvitamin D3 receptor Nuclear receptor subfamily 1 group I member 1 VDR | VDR_HUMAN
Type:
Protein
Mol. Mass.:
48288.72
Organism:
Homo sapiens (Human)
Description:
P11473
Residue:
427
  
Inhibitor
Name:
BDBM21680
Synonyms:
(4R)-4-[(1S,2S,5R,7S,9R,10R,11S,14R,15R,16S)-5,9,16-trihydroxy-2,15-dimethyltetracyclo[8.7.0.0^{2,7}.0^{11,15}]heptadecan-14-yl]pentanoic acid 3alpha,7alpha,12alpha-trihydroxy-5beta-cholan-24-oic acid CHEMBL205596 Cholate cholicacid
Type:
Steroid
Emp. Form.:
C24H40O5
Mol. Mass.:
408.5714
SMILES:
[H][C@@]1(CC[C@@]2([H])[C@]3([H])[C@H](O)C[C@]4([H])C[C@H](O)CC[C@]4(C)[C@@]3([H])C[C@H](O)[C@]12C)[C@H](C)CCC(O)=O
: