Target
5-hydroxytryptamine receptor 1E
Ligand
BDBM50140058
Substrate
Meas. Tech.
ChEMBL_1550136 (CHEMBL3756278)
Ki
380±n/a nM
Citation
 Cozzi, NVDaley, PF Receptor binding profiles and quantitative structure-affinity relationships of some 5-substituted-N,N-diallyltryptamines. Bioorg Med Chem Lett 26:959-64 (2016)  
Target
Name:
5-hydroxytryptamine receptor 1E
Synonyms:
5-HT-1E 5-Hydroxytryptamine Receptor Subtype 1E (5HT1E) 5-hydroxytryptamine receptor 1E (5-HT-1E) (S31) 5HT1E_HUMAN S31 Serotonin 1e (5-HT1e) receptor | Serotonin Receptor 1E
Type:
G Protein-Coupled Receptor (GPCR)
Mol. Mass.:
41697.80
Organism:
Homo sapiens (Human)
Description:
gi_112822
Residue:
365
  
Inhibitor
Name:
BDBM50140058
Synonyms:
CHEMBL3752576
Type:
Small organic molecule
Emp. Form.:
C16H20N2
Mol. Mass.:
240.3434
SMILES:
C=CCN(CCc1c[nH]c2ccccc12)CC=C
: