Target
Sodium-dependent serotonin transporter
Ligand
BDBM50435344
Substrate
Meas. Tech.
ChEMBL_1550159 (CHEMBL3756500)
Ki
501±n/a nM
Citation
 Cozzi, NVDaley, PF Receptor binding profiles and quantitative structure-affinity relationships of some 5-substituted-N,N-diallyltryptamines. Bioorg Med Chem Lett 26:959-64 (2016)  
Target
Name:
Sodium-dependent serotonin transporter
Synonyms:
5-HT Transporter 5HTT SC6A4_HUMAN SLC6A4 Serotonin transporter (5HTT) Sodium-dependent serotonin transporter (SERT) | Solute carrier family 6 member 4
Type:
Multi-pass membrane protein
Mol. Mass.:
70322.51
Organism:
Homo sapiens (Human)
Description:
P31645
Residue:
630
  
Inhibitor
Name:
BDBM50435344
Synonyms:
CHEMBL2391541
Type:
Small organic molecule
Emp. Form.:
C17H22N2O
Mol. Mass.:
270.3694
SMILES:
COc1ccc2[nH]cc(CCN(CC=C)CC=C)c2c1
: