Target
Sodium-dependent serotonin transporter
Ligand
BDBM85097
Substrate
Meas. Tech.
ChEMBL_1547206 (CHEMBL3756313)
Ki
1772±n/a nM
Citation
 Éliás, ONógrádi, KDomány, GSzakács, ZKóti, JSzántay, CTarcsay, ÁKeseru, GMGere, AKiss, BKurkó, DKolok, SNémethy, ZKapui, ZHellinger, ÉVastag, MSághy, KKedves, RGyertyán, I The influence of 5-HT(2A) activity on a 5-HT(2C) specific in vivo assay used for early identification of multiple acting SERT and 5-HT(2C) receptor ligands. Bioorg Med Chem Lett 26:914-20 (2016)  
Target
Name:
Sodium-dependent serotonin transporter
Synonyms:
5-HT Transporter 5HT transporter Anandamid membrane transporter, AMT Monoamine transporters; Norepinephrine & serotonin Slc6a4 Sodium-dependent serotonin transporter (SERT) | imipramine receptor
Type:
Multi-pass membrane protein
Mol. Mass.:
70168.43
Organism:
Rattus norvegicus (rat)
Description:
P31652
Residue:
630
  
Inhibitor
Name:
BDBM85097
Synonyms:
CAS_181632-25-7 SB 242084
Type:
Small organic molecule
Emp. Form.:
C21H19ClN4O2
Mol. Mass.:
394.854
SMILES:
Cc1cc2CCN(C(=O)Nc3ccc(Oc4cccnc4C)nc3)c2cc1Cl
: