Target
Sodium-dependent serotonin transporter
Ligand
BDBM50013052
Substrate
Meas. Tech.
ChEMBL_1547206 (CHEMBL3756313)
Ki
41±n/a nM
Citation
 Éliás, ONógrádi, KDomány, GSzakács, ZKóti, JSzántay, CTarcsay, ÁKeseru, GMGere, AKiss, BKurkó, DKolok, SNémethy, ZKapui, ZHellinger, ÉVastag, MSághy, KKedves, RGyertyán, I The influence of 5-HT(2A) activity on a 5-HT(2C) specific in vivo assay used for early identification of multiple acting SERT and 5-HT(2C) receptor ligands. Bioorg Med Chem Lett 26:914-20 (2016)  
Target
Name:
Sodium-dependent serotonin transporter
Synonyms:
5-HT Transporter 5HT transporter Anandamid membrane transporter, AMT Monoamine transporters; Norepinephrine & serotonin Slc6a4 Sodium-dependent serotonin transporter (SERT) | imipramine receptor
Type:
Multi-pass membrane protein
Mol. Mass.:
70168.43
Organism:
Rattus norvegicus (rat)
Description:
P31652
Residue:
630
  
Inhibitor
Name:
BDBM50013052
Synonyms:
CHEMBL3261695
Type:
Small organic molecule
Emp. Form.:
C25H28ClN3O3
Mol. Mass.:
453.961
SMILES:
COc1ccc(NC(=O)Nc2ccc(OC(CCN(C)C)c3ccccc3)cc2)cc1Cl
: