Target
5-hydroxytryptamine receptor 2A
Ligand
BDBM85097
Substrate
Meas. Tech.
ChEMBL_1547208 (CHEMBL3756315)
Ki
274±n/a nM
Citation
 Éliás, ONógrádi, KDomány, GSzakács, ZKóti, JSzántay, CTarcsay, ÁKeseru, GMGere, AKiss, BKurkó, DKolok, SNémethy, ZKapui, ZHellinger, ÉVastag, MSághy, KKedves, RGyertyán, I The influence of 5-HT(2A) activity on a 5-HT(2C) specific in vivo assay used for early identification of multiple acting SERT and 5-HT(2C) receptor ligands. Bioorg Med Chem Lett 26:914-20 (2016)  
Target
Name:
5-hydroxytryptamine receptor 2A
Synonyms:
5-HT-2A 5-HT2A 5-hydroxytryptamine receptor 2A (5HT2A) Htr2 Serotonin Receptor 2A
Type:
G Protein-Coupled Receptor (GPCR)
Mol. Mass.:
52852.05
Organism:
Rattus norvegicus (rat)
Description:
Rat cortex membranes 5-HT2A receptors.
Residue:
471
  
Inhibitor
Name:
BDBM85097
Synonyms:
CAS_181632-25-7 SB 242084
Type:
Small organic molecule
Emp. Form.:
C21H19ClN4O2
Mol. Mass.:
394.854
SMILES:
Cc1cc2CCN(C(=O)Nc3ccc(Oc4cccnc4C)nc3)c2cc1Cl
: