Target
Amino acid transporter
Ligand
BDBM50140080
Substrate
Meas. Tech.
ChEMBL_1547439 (CHEMBL3757558)
IC50
17300±n/a nM
Citation
 Schulte, MLKhodadadi, ABCuthbertson, MLSmith, JAManning, HC 2-Amino-4-bis(aryloxybenzyl)aminobutanoic acids: A novel scaffold for inhibition of ASCT2-mediated glutamine transport. Bioorg Med Chem Lett 26:1044-7 (2016)  
Target
Name:
Amino acid transporter
Synonyms:
Amino acid transporter | Slc1a5
Type:
PROTEIN
Mol. Mass.:
56758.53
Organism:
Rattus norvegicus
Description:
ChEMBL_109757
Residue:
539
  
Inhibitor
Name:
BDBM50140080
Synonyms:
CHEMBL3754415
Type:
Small organic molecule
Emp. Form.:
C30H32N4O4
Mol. Mass.:
512.5995
SMILES:
N[C@@H](CCN(Cc1ccccc1OCc1cccnc1)Cc1ccccc1OCc1cccnc1)C(O)=O
: