Target
Histone deacetylase 3
Ligand
BDBM50140176
Substrate
Meas. Tech.
ChEMBL_1547660 (CHEMBL3755711)
IC50
5370±n/a nM
Citation
 Ai, TQiu, LXie, JGeraghty, RJChen, L Design and synthesis of an activity-based protein profiling probe derived from cinnamic hydroxamic acid. Bioorg Med Chem 24:686-92 (2016)  
Target
Name:
Histone deacetylase 3
Synonyms:
HD3 HDAC3_HUMAN Human HDAC3 SMAP45
Type:
Enzyme
Mol. Mass.:
48829.55
Organism:
Homo sapiens (Human)
Description:
O15379
Residue:
428
  
Inhibitor
Name:
BDBM50140176
Synonyms:
CHEMBL3394285
Type:
Small organic molecule
Emp. Form.:
C10H8F3NO2
Mol. Mass.:
231.1712
SMILES:
ONC(=O)\C=C\c1ccc(cc1)C(F)(F)F
: