Target
Disintegrin and metalloproteinase domain-containing protein 17
Ligand
BDBM50140176
Substrate
Meas. Tech.
ChEMBL_1547680 (CHEMBL3755731)
IC50
21500±n/a nM
Citation
 Ai, TQiu, LXie, JGeraghty, RJChen, L Design and synthesis of an activity-based protein profiling probe derived from cinnamic hydroxamic acid. Bioorg Med Chem 24:686-92 (2016)  
Target
Name:
Disintegrin and metalloproteinase domain-containing protein 17
Synonyms:
ADA17_HUMAN CSVP Disintegrin and metalloproteinase domain-containing protein 17 (ADAM17) TNF-alpha convertase TNF-alpha-converting enzyme (TACE) Tumor necrosis factor-α converting enzyme (TACE)
Type:
Enzyme
Mol. Mass.:
93007.89
Organism:
Homo sapiens (Human)
Description:
Residue:
824
  
Inhibitor
Name:
BDBM50140176
Synonyms:
CHEMBL3394285
Type:
Small organic molecule
Emp. Form.:
C10H8F3NO2
Mol. Mass.:
231.1712
SMILES:
ONC(=O)\C=C\c1ccc(cc1)C(F)(F)F
: