Target
Adenosine receptor A2a
Ligand
BDBM50140279
Substrate
Meas. Tech.
ChEMBL_1548614 (CHEMBL3757433)
Ki
12±n/a nM
Citation
 Robinson, SJPetzer, JPRousseau, ALTerre'Blanche, GPetzer, ALourens, AC Carbamate substituted 2-amino-4,6-diphenylpyrimidines as adenosine receptor antagonists. Bioorg Med Chem Lett 26:734-8 (2016)  
Target
Name:
Adenosine receptor A2a
Synonyms:
AA2AR_RAT Adenosine A2 receptor Adenosine Receptors A2a (A2a) Adenosine receptors A2a Rat striatal adenosine A2a receptor
Type:
G Protein-Coupled Receptor (GPCR)
Mol. Mass.:
45015.65
Organism:
Rattus norvegicus (rat)
Description:
Rat A2A receptors expressed in CHO cells.
Residue:
410
  
Inhibitor
Name:
BDBM50140279
Synonyms:
CHEMBL3754252
Type:
Small organic molecule
Emp. Form.:
C23H26N4O2
Mol. Mass.:
390.4781
SMILES:
CC(C)N(C(C)C)C(=O)Oc1cccc(c1)-c1cc(nc(N)n1)-c1ccccc1
: