Target
Period circadian protein homolog 2
Ligand
BDBM50140884
Substrate
Meas. Tech.
ChEMBL_1548653 (CHEMBL3757653)
EC50
400±n/a nM
Citation
 Humphries, PSBersot, RKincaid, JMabery, EMcCluskie, KPark, TRenner, TRiegler, ESteinfeld, TTurtle, EDWei, ZLWillis, E Carbazole-containing sulfonamides and sulfamides: Discovery of cryptochrome modulators as antidiabetic agents. Bioorg Med Chem Lett 26:757-60 (2016)  
Target
Name:
Period circadian protein homolog 2
Synonyms:
Circadian clock protein PERIOD 2 PER2 Period circadian protein homolog 2 | hPER2
Type:
PROTEIN
Mol. Mass.:
136576.47
Organism:
Homo sapiens (Human)
Description:
ChEMBL_116705
Residue:
1255
  
Inhibitor
Name:
BDBM50140884
Synonyms:
CHEMBL3752425
Type:
Small organic molecule
Emp. Form.:
C22H21FN2O3S
Mol. Mass.:
412.477
SMILES:
CS(=O)(=O)N(CC(O)Cn1c2ccccc2c2ccccc12)c1cccc(F)c1
: