Target
Period circadian protein homolog 2
Ligand
BDBM50140892
Substrate
Meas. Tech.
ChEMBL_1548653 (CHEMBL3757653)
EC50
132±n/a nM
Citation
 Humphries, PSBersot, RKincaid, JMabery, EMcCluskie, KPark, TRenner, TRiegler, ESteinfeld, TTurtle, EDWei, ZLWillis, E Carbazole-containing sulfonamides and sulfamides: Discovery of cryptochrome modulators as antidiabetic agents. Bioorg Med Chem Lett 26:757-60 (2016)  
Target
Name:
Period circadian protein homolog 2
Synonyms:
Circadian clock protein PERIOD 2 PER2 Period circadian protein homolog 2 | hPER2
Type:
PROTEIN
Mol. Mass.:
136576.47
Organism:
Homo sapiens (Human)
Description:
ChEMBL_116705
Residue:
1255
  
Inhibitor
Name:
BDBM50140892
Synonyms:
CHEMBL3752737
Type:
Small organic molecule
Emp. Form.:
C18H21N3O3S
Mol. Mass.:
359.443
SMILES:
CN1CCN(CC(O)Cn2c3ccccc3c3ccccc23)S1(=O)=O
: