Target
3-oxo-5-alpha-steroid 4-dehydrogenase 1
Ligand
BDBM50141090
Substrate
Meas. Tech.
ChEMBL_1549079 (CHEMBL3756872)
IC50
547±n/a nM
Citation
 Aggarwal, SMahapatra, MKKumar, RBhardwaj, TRHartmann, RWHaupenthal, JKumar, M Synthesis and biological evaluation of 3-tetrazolo steroidal analogs: Novel class of 5a-reductase inhibitors. Bioorg Med Chem 24:779-88 (2016)  
Target
Name:
3-oxo-5-alpha-steroid 4-dehydrogenase 1
Synonyms:
3-oxo-5-alpha-steroid 4-dehydrogenase 1 S5A1_HUMAN SR type 1 Steroid 5-alpha-reductase | Steroid 5-alpha-reductase 1
Type:
Enzyme
Mol. Mass.:
29472.80
Organism:
Homo sapiens (Human)
Description:
P18405
Residue:
259
  
Inhibitor
Name:
BDBM50141090
Synonyms:
CHEMBL3753791
Type:
Small organic molecule
Emp. Form.:
C22H30N4O
Mol. Mass.:
366.4998
SMILES:
[H][C@@]12CCC(C(C)=O)[C@@]1(C)CC[C@@]1([H])[C@@]2([H])CC=C2C=C(CC[C@]12C)c1nnn[nH]1
: