Target
5-hydroxytryptamine receptor 4
Ligand
BDBM50142922
Substrate
Meas. Tech.
ChEMBL_1552714 (CHEMBL3762971)
IC50
377±n/a nM
Citation
 Park, JSIm, WChoi, SPark, SJJung, JMBaek, KSSon, HPSharma, SKim, ISJung, YH Discovery and SAR of N-(1-((substituted piperidin-4-yl)methyl)-3-methoxypiperidin-4-yl)-2-methoxybenzamide derivatives: 5-Hydroxytryptamine receptor 4 agonist as a potent prokinetic agent. Eur J Med Chem 109:75-88 (2016)  
Target
Name:
5-hydroxytryptamine receptor 4
Synonyms:
5-HT-4 5-HT4S 5-HT4b 5-HT4d 5-hydroxytryptamine receptor 4 5HT4R_HUMAN Serotonin (5-HT) receptor Serotonin 4 (5-HT4) receptor | Serotonin Receptor 4
Type:
Enzyme
Mol. Mass.:
43767.54
Organism:
Homo sapiens (Human)
Description:
Q13639
Residue:
388
  
Inhibitor
Name:
BDBM50142922
Synonyms:
CHEMBL3758398
Type:
Small organic molecule
Emp. Form.:
C23H35ClN4O5
Mol. Mass.:
483.001
SMILES:
CCOC(=O)N1CCC(CN2CC[C@H](NC(=O)c3cc(Cl)c(N)cc3OC)[C@@H](C2)OC)CC1
: