Target
Potassium voltage-gated channel subfamily H member 2
Ligand
BDBM50142911
Substrate
Meas. Tech.
ChEMBL_1552715 (CHEMBL3762972)
IC50
>10000±n/a nM
Citation
 Park, JSIm, WChoi, SPark, SJJung, JMBaek, KSSon, HPSharma, SKim, ISJung, YH Discovery and SAR of N-(1-((substituted piperidin-4-yl)methyl)-3-methoxypiperidin-4-yl)-2-methoxybenzamide derivatives: 5-Hydroxytryptamine receptor 4 agonist as a potent prokinetic agent. Eur J Med Chem 109:75-88 (2016)  
Target
Name:
Potassium voltage-gated channel subfamily H member 2
Synonyms:
1,3-beta-glucan synthase component GLS2 ERG Eag-related protein 1 Ether-a-go-go-related gene (HERG) Ether-a-go-go-related gene potassium channel 1 Ether-a-go-go-related gene potassium channel 1 (hERG1) Ether-a-go-go-related protein 1 H-ERG KCNH2 Potassium voltage-gated channel subfamily H member 2 (hERG) Voltage-gated potassium channel subunit Kv11.1 hERG Potassium Channel 1 | putative potassium channel subunit
Type:
Multi-pass membrane protein
Mol. Mass.:
126672.65
Organism:
Homo sapiens (Human)
Description:
Q12809
Residue:
1159
  
Inhibitor
Name:
BDBM50142911
Synonyms:
CHEMBL3758578
Type:
Small organic molecule
Emp. Form.:
C21H31ClN4O4
Mol. Mass.:
438.948
SMILES:
CO[C@@H]1CN(CCC(=O)N2CCCC2)CC[C@@H]1NC(=O)c1cc(Cl)c(N)cc1OC
: