Target
Hepatocyte growth factor receptor
Ligand
BDBM50143253
Substrate
Meas. Tech.
ChEMBL_1550500 (CHEMBL3762038)
IC50
>100±n/a nM
Citation
 Liu, YJin, SPeng, XLu, DZeng, LSun, YAi, JGeng, MHu, Y Pyridazinone derivatives displaying highly potent and selective inhibitory activities against c-Met tyrosine kinase. Eur J Med Chem 108:322-33 (2016)  
Target
Name:
Hepatocyte growth factor receptor
Synonyms:
Hepatocyte growth factor receptor Hepatocyte growth factor receptor (c-MET) MET Met proto-oncogene (hepatocyte growth factor receptor) Tyrosine-protein kinase Met (c-Met) c-Met kinase
Type:
Protein
Mol. Mass.:
155559.73
Organism:
Homo sapiens (Human)
Description:
P08581
Residue:
1390
  
Inhibitor
Name:
BDBM50143253
Synonyms:
CHEMBL3758256
Type:
Small organic molecule
Emp. Form.:
C24H22N8O
Mol. Mass.:
438.4845
SMILES:
Cn1cc(cn1)-c1ccc(Nc2cccc(Cn3nc(ccc3=O)-c3cnn(C)c3)c2)nc1
: