Target
Carbonic anhydrase 9
Ligand
BDBM50143985
Substrate
Meas. Tech.
ChEMBL_1551382 (CHEMBL3762503)
Ki
239±n/a nM
Citation
 Carradori, SSecci, DDe Monte, CMollica, ACeruso, MAkdemir, ASobolev, APCodispoti, RDe Cosmi, FGuglielmi, PSupuran, CT A novel library of saccharin and acesulfame derivatives as potent and selective inhibitors of carbonic anhydrase IX and XII isoforms. Bioorg Med Chem 24:1095-105 (2016)  
Target
Name:
Carbonic anhydrase 9
Synonyms:
CA-IX CAH9_HUMAN Carbonic anhydrase 9 (CA IX) Carbonic anhydrase 9 precursor Carbonic anhydrase IX (CAIX) Carbonic anhydrases; II & IX MN RCC-associated antigen G250
Type:
Enzyme
Mol. Mass.:
49669.03
Organism:
Homo sapiens (Human)
Description:
Catalytic domain of human cloned isozyme was used in the assay
Residue:
459
  
Inhibitor
Name:
BDBM50143985
Synonyms:
CHEMBL3758373
Type:
Small organic molecule
Emp. Form.:
C11H10ClNO4S
Mol. Mass.:
287.719
SMILES:
CC1=CC(=O)N(Cc2ccc(Cl)cc2)S(=O)(=O)O1
: