Target
Palmitoleoyl-protein carboxylesterase NOTUM
Ligand
BDBM50144576
Substrate
Meas. Tech.
ChEMBL_1551504 (CHEMBL3762925)
EC50
34±n/a nM
Citation
 Han, QPabba, PKBarbosa, JMabon, RHealy, JPGardyan, MWTerranova, KMBrommage, RThompson, AYSchmidt, JMWilson, AGXu, XTarver, JECarson, KG 4H-Thieno[3,2-c]chromene based inhibitors of Notum Pectinacetylesterase. Bioorg Med Chem Lett 26:1184-7 (2016)  
Target
Name:
Palmitoleoyl-protein carboxylesterase NOTUM
Synonyms:
NOTUM Palmitoleoyl-protein carboxylesterase NOTUM | hNOTUM
Type:
PROTEIN
Mol. Mass.:
55706.36
Organism:
Homo sapiens (Human)
Description:
ChEMBL_116492
Residue:
496
  
Inhibitor
Name:
BDBM50144576
Synonyms:
CHEMBL3760106
Type:
Small organic molecule
Emp. Form.:
C13H8Cl2O2S
Mol. Mass.:
299.172
SMILES:
OC(=O)c1cc2CCc3c(Cl)cc(Cl)cc3-c2s1
: