Target
Aminopeptidase N
Ligand
BDBM50144923
Substrate
Meas. Tech.
ChEMBL_1555944 (CHEMBL3767299)
IC50
80±n/a nM
Citation
 Ma, CCao, JLiang, XHuang, YWu, PLi, YXu, WZhang, Y Novel leucine ureido derivatives as aminopeptidase N inhibitors. Design, synthesis and activity evaluation. Eur J Med Chem 108:21-7 (2016)  
Target
Name:
Aminopeptidase N
Synonyms:
AMPN_PIG AP-M Alanyl aminopeptidase Aminopeptidase N (APN) Microsomal aminopeptidase pAPN
Type:
Protein
Mol. Mass.:
108810.25
Organism:
Sus scrofa (Pig)
Description:
P15145
Residue:
963
  
Inhibitor
Name:
BDBM50144923
Synonyms:
CHEMBL3764156
Type:
Small organic molecule
Emp. Form.:
C16H25N3O3
Mol. Mass.:
307.388
SMILES:
CC(C)C[C@H](NC(=O)Nc1c(C)cc(C)cc1C)C(=O)NO
: