Target
Aminopeptidase N
Ligand
BDBM50144931
Substrate
Meas. Tech.
ChEMBL_1555946 (CHEMBL3767301)
IC50
280±n/a nM
Citation
 Ma, CCao, JLiang, XHuang, YWu, PLi, YXu, WZhang, Y Novel leucine ureido derivatives as aminopeptidase N inhibitors. Design, synthesis and activity evaluation. Eur J Med Chem 108:21-7 (2016)  
Target
Name:
Aminopeptidase N
Synonyms:
AMPN_HUMAN APN Aminopeptidase CD_antigen=CD13 Myeloid plasma membrane glycoprotein CD13 gp150 | hAPN
Type:
PROTEIN
Mol. Mass.:
109522.63
Organism:
Homo sapiens (Human)
Description:
ChEMBL_1507526
Residue:
967
  
Inhibitor
Name:
BDBM50144931
Synonyms:
CHEMBL3764432
Type:
Small organic molecule
Emp. Form.:
C17H27N3O3
Mol. Mass.:
321.4146
SMILES:
CCc1cccc(CC)c1NC(=O)N[C@@H](CC(C)C)C(=O)NO
: