Target
Serine-protein kinase ATM
Ligand
BDBM50145037
Substrate
Meas. Tech.
ChEMBL_1556176 (CHEMBL3768630)
IC50
6.3±n/a nM
Citation
 Min, JGuo, KSuryadevara, PKZhu, FHolbrook, GChen, YFeau, CYoung, BMLemoff, AConnelly, MCKastan, MBGuy, RK Optimization of a Novel Series of Ataxia-Telangiectasia Mutated Kinase Inhibitors as Potential Radiosensitizing Agents. J Med Chem 59:559-77 (2016)  
Target
Name:
Serine-protein kinase ATM
Synonyms:
A-T mutated ATM_HUMAN | Ataxia telangiectasia mutated
Type:
Protein
Mol. Mass.:
350696.72
Organism:
Homo sapiens (Human)
Description:
Q13315
Residue:
3056
  
Inhibitor
Name:
BDBM50145037
Synonyms:
CHEMBL3765783
Type:
Small organic molecule
Emp. Form.:
C29H31N3O5S2
Mol. Mass.:
565.704
SMILES:
C[C@H]1CN(CC(=O)Nc2ccc3Sc4c(Sc3c2)cccc4-c2cc(=O)cc(o2)N2CCOCC2)C[C@@H](C)O1
: