Target
Amine oxidase [flavin-containing] A
Ligand
BDBM50145629
Substrate
Meas. Tech.
ChEMBL_1556249 (CHEMBL3769071)
IC50
424±n/a nM
Citation
 Mostert, SPetzer, APetzer, JP Inhibition of monoamine oxidase by benzoxathiolone analogues. Bioorg Med Chem Lett 26:1200-4 (2016)  
Target
Name:
Amine oxidase [flavin-containing] A
Synonyms:
AOFA_HUMAN MAO-A Monoamine oxidase Monoamine oxidase type A (MAO A) Monoamine oxidase type A (MAOA)
Type:
Protein
Mol. Mass.:
59689.53
Organism:
Homo sapiens (Human)
Description:
P21397
Residue:
527
  
Inhibitor
Name:
BDBM50145629
Synonyms:
CHEMBL3763837
Type:
Small organic molecule
Emp. Form.:
C14H9ClO3S
Mol. Mass.:
292.737
SMILES:
Clc1cccc(COc2ccc3sc(=O)oc3c2)c1
: