Target
Amine oxidase [flavin-containing] B
Ligand
BDBM50334284
Substrate
Meas. Tech.
ChEMBL_1556248 (CHEMBL3769070)
IC50
103±n/a nM
Citation
 Mostert, SPetzer, APetzer, JP Inhibition of monoamine oxidase by benzoxathiolone analogues. Bioorg Med Chem Lett 26:1200-4 (2016)  
Target
Name:
Amine oxidase [flavin-containing] B
Synonyms:
AOFB_HUMAN MAOB Monoamine oxidase type B (MAO B) Monoamine oxidase type B (MAOB)
Type:
Protein
Mol. Mass.:
58768.76
Organism:
Homo sapiens (Human)
Description:
P27338
Residue:
520
  
Inhibitor
Name:
BDBM50334284
Synonyms:
5-Benzyloxyisatin | CHEMBL1642670
Type:
Small organic molecule
Emp. Form.:
C15H11NO3
Mol. Mass.:
253.2527
SMILES:
O=C1Nc2ccc(OCc3ccccc3)cc2C1=O
: