Target
Tryptophan 5-hydroxylase 1
Ligand
BDBM50145644
Substrate
Meas. Tech.
ChEMBL_1556269 (CHEMBL3769268)
IC50
1050±n/a nM
Citation
 Goldberg, DRDe Lombaert, SAiello, RBourassa, PBarucci, NZhang, QParalkar, VValentine, JZavadoski, W Discovery of spirocyclic proline tryptophan hydroxylase-1 inhibitors. Bioorg Med Chem Lett 26:1124-9 (2016)  
Target
Name:
Tryptophan 5-hydroxylase 1
Synonyms:
TPH TPH1_HUMAN TRPH | Tryptophan 5-monooxygenase 1
Type:
PROTEIN
Mol. Mass.:
50990.64
Organism:
Homo sapiens (Human)
Description:
ChEMBL_1361824
Residue:
444
  
Inhibitor
Name:
BDBM50145644
Synonyms:
CHEMBL3763222
Type:
Small organic molecule
Emp. Form.:
C25H29ClF3N7O3
Mol. Mass.:
567.991
SMILES:
CC1CN(CC(C)C1NCC(O)=O)c1cc(O[C@H](c2ccc(Cl)cc2-n2ccc(C)n2)C(F)(F)F)nc(N)n1
: