Target
Estrogen receptor
Ligand
BDBM50145854
Substrate
Meas. Tech.
ChEMBL_1553920 (CHEMBL3767740)
EC50
5.2±n/a nM
Citation
 Xiong, RPatel, HKGutgesell, LMZhao, JDelgado-Rivera, LPham, TNZhao, HCarlson, KMartin, TKatzenellenbogen, JAMoore, TWTonetti, DAThatcher, GR Selective Human Estrogen Receptor Partial Agonists (ShERPAs) for Tamoxifen-Resistant Breast Cancer. J Med Chem 59:219-37 (2016)  
Target
Name:
Estrogen receptor
Synonyms:
ER ESR ESR1_HUMAN Estrogen receptor Estrogen receptor (ER-alpha) Estrogen receptor alpha (ER) Nuclear receptor subfamily 3 group A member 1
Type:
Protein
Mol. Mass.:
66230.44
Organism:
Homo sapiens (Human)
Description:
P03372
Residue:
595
  
Inhibitor
Name:
BDBM50145854
Synonyms:
CHEMBL3765211
Type:
Small organic molecule
Emp. Form.:
C22H12F4O2S
Mol. Mass.:
416.388
SMILES:
Oc1ccc2c(c(sc2c1)C(=O)c1ccc(cc1)C(F)(F)F)-c1ccc(F)cc1
: