Target
Progesterone receptor
Ligand
BDBM50145860
Substrate
Meas. Tech.
ChEMBL_1553956 (CHEMBL3767968)
Ki
1220±n/a nM
Citation
 Saeed, AVaught, GMGavardinas, KMatthews, DGreen, JELosada, PGBullock, HACalvert, NAPatel, NJSweetana, SAKrishnan, VHenck, JWLuz, JGWang, YJadhav, P 2-Chloro-4-[[(1R,2R)-2-hydroxy-2-methyl-cyclopentyl]amino]-3-methyl-benzonitrile: A Transdermal Selective Androgen Receptor Modulator (SARM) for Muscle Atrophy. J Med Chem 59:750-5 (2016)  
Target
Name:
Progesterone receptor
Synonyms:
NR3C3 PGR PRGR_HUMAN | progesterone
Type:
Protein
Mol. Mass.:
98979.52
Organism:
Homo sapiens (Human)
Description:
P06401
Residue:
933
  
Inhibitor
Name:
BDBM50145860
Synonyms:
CHEMBL3764446
Type:
Small organic molecule
Emp. Form.:
C13H15ClN2O2
Mol. Mass.:
266.723
SMILES:
Cc1c(N[C@@H]2COC[C@@]2(C)O)ccc(C#N)c1Cl
: