Target
Mineralocorticoid receptor
Ligand
BDBM50145860
Substrate
Meas. Tech.
ChEMBL_1553955 (CHEMBL3767967)
Ki
>7010±n/a nM
Citation
 Saeed, AVaught, GMGavardinas, KMatthews, DGreen, JELosada, PGBullock, HACalvert, NAPatel, NJSweetana, SAKrishnan, VHenck, JWLuz, JGWang, YJadhav, P 2-Chloro-4-[[(1R,2R)-2-hydroxy-2-methyl-cyclopentyl]amino]-3-methyl-benzonitrile: A Transdermal Selective Androgen Receptor Modulator (SARM) for Muscle Atrophy. J Med Chem 59:750-5 (2016)  
Target
Name:
Mineralocorticoid receptor
Synonyms:
MCR MLR NR3C2 | Nuclear receptor subfamily 3 group C member 2
Type:
Enzyme
Mol. Mass.:
107076.42
Organism:
Homo sapiens (Human)
Description:
P08235
Residue:
984
  
Inhibitor
Name:
BDBM50145860
Synonyms:
CHEMBL3764446
Type:
Small organic molecule
Emp. Form.:
C13H15ClN2O2
Mol. Mass.:
266.723
SMILES:
Cc1c(N[C@@H]2COC[C@@]2(C)O)ccc(C#N)c1Cl
: