Target
Hexokinase-4
Ligand
BDBM50145874
Substrate
Meas. Tech.
ChEMBL_1554117 (CHEMBL3768919)
EC50
12±n/a nM
Citation
 Paczal, ABálint, BWéber, CSzabó, ZBOndi, LTheret, IDe Ceuninck, FBernard, CKtorza, APerron-Sierra, FKotschy, A Structure-Activity Relationship of Azaindole-Based Glucokinase Activators. J Med Chem 59:687-706 (2016)  
Target
Name:
Hexokinase-4
Synonyms:
GCK Glucokinase (GK) HK IV HXK4_HUMAN Hexokinase-D
Type:
Enzyme
Mol. Mass.:
52175.81
Organism:
Homo sapiens (Human)
Description:
P35557
Residue:
465
  
Inhibitor
Name:
BDBM50145874
Synonyms:
CHEMBL3764079
Type:
Small organic molecule
Emp. Form.:
C21H21ClN2O2S
Mol. Mass.:
400.922
SMILES:
CS(=O)(=O)c1ccc(cc1Cl)C(=C\C1CCCC1)\c1cc2cccnc2[nH]1
: