Target
Hepatocyte growth factor receptor
Ligand
BDBM50347659
Substrate
Meas. Tech.
ChEMBL_1555042 (CHEMBL3767620)
IC50
0.400000±n/a nM
Citation
 Zhang, JJiang, XJiang, YGuo, MZhang, SLi, JHe, JLiu, JWang, JOuyang, L Recent advances in the development of dual VEGFR and c-Met small molecule inhibitors as anticancer drugs. Eur J Med Chem 108:495-504 (2016)  
Target
Name:
Hepatocyte growth factor receptor
Synonyms:
Hepatocyte growth factor receptor Hepatocyte growth factor receptor (c-MET) MET Met proto-oncogene (hepatocyte growth factor receptor) Tyrosine-protein kinase Met (c-Met) c-Met kinase
Type:
Protein
Mol. Mass.:
155559.73
Organism:
Homo sapiens (Human)
Description:
P08581
Residue:
1390
  
Inhibitor
Name:
BDBM50347659
Synonyms:
CHEMBL1802916 | MK-2461
Type:
Small organic molecule
Emp. Form.:
C24H25N5O5S
Mol. Mass.:
495.551
SMILES:
CN(C[C@@H]1COCCO1)S(=O)(=O)Nc1ccc2ccc3ncc(cc3c(=O)c2c1)-c1cnn(C)c1
: