Target
Nuclear receptor subfamily 1 group I member 3
Ligand
BDBM31774
Substrate
Meas. Tech.
ChEMBL_1555043 (CHEMBL3767621)
Ki
100±n/a nM
Citation
 Lin, WYang, LChai, SCLu, YChen, T Development of CINPA1 analogs as novel and potent inverse agonists of constitutive androstane receptor. Eur J Med Chem 108:505-28 (2016)  
Target
Name:
Nuclear receptor subfamily 1 group I member 3
Synonyms:
CAR NR1I3_HUMAN
Type:
PROTEIN
Mol. Mass.:
39953.17
Organism:
Homo sapiens (Human)
Description:
ChEMBL_1434936
Residue:
352
  
Inhibitor
Name:
BDBM31774
Synonyms:
CHEMBL104 Clotrimazole Mycelex cid_2812
Type:
Small organic molecule
Emp. Form.:
C22H17ClN2
Mol. Mass.:
344.837
SMILES:
Clc1ccccc1C(c1ccccc1)(c1ccccc1)n1ccnc1
: