Target
Nuclear receptor subfamily 1 group I member 3
Ligand
BDBM50146318
Substrate
Meas. Tech.
ChEMBL_1555044 (CHEMBL3767622)
IC50
3180±n/a nM
Citation
 Lin, WYang, LChai, SCLu, YChen, T Development of CINPA1 analogs as novel and potent inverse agonists of constitutive androstane receptor. Eur J Med Chem 108:505-28 (2016)  
Target
Name:
Nuclear receptor subfamily 1 group I member 3
Synonyms:
CAR NR1I3_HUMAN
Type:
PROTEIN
Mol. Mass.:
39953.17
Organism:
Homo sapiens (Human)
Description:
ChEMBL_1434936
Residue:
352
  
Inhibitor
Name:
BDBM50146318
Synonyms:
CHEMBL3765099
Type:
Small organic molecule
Emp. Form.:
C24H29N3O3
Mol. Mass.:
407.5054
SMILES:
CCOC(=O)Nc1ccc2CCc3ccccc3N(C(=O)CCN3CCCC3)c2c1
: