Target
Nuclear receptor subfamily 1 group I member 3
Ligand
BDBM50146322
Substrate
Meas. Tech.
ChEMBL_1555044 (CHEMBL3767622)
IC50
6890±n/a nM
Citation
 Lin, WYang, LChai, SCLu, YChen, T Development of CINPA1 analogs as novel and potent inverse agonists of constitutive androstane receptor. Eur J Med Chem 108:505-28 (2016)  
Target
Name:
Nuclear receptor subfamily 1 group I member 3
Synonyms:
CAR NR1I3_HUMAN
Type:
PROTEIN
Mol. Mass.:
39953.17
Organism:
Homo sapiens (Human)
Description:
ChEMBL_1434936
Residue:
352
  
Inhibitor
Name:
BDBM50146322
Synonyms:
CHEMBL3765224
Type:
Small organic molecule
Emp. Form.:
C22H22N4O3
Mol. Mass.:
390.4351
SMILES:
CCOC(=O)Nc1ccc2CCc3ccccc3N(C(=O)Cn3ccnc3)c2c1
: