Target
Indoleamine 2,3-dioxygenase 1
Ligand
BDBM50146460
Substrate
Meas. Tech.
ChEMBL_1555055 (CHEMBL3767633)
IC50
95±n/a nM
Citation
 Malachowski, WPWinters, MDuHadaway, JBLewis-Ballester, ABadir, SWai, JRahman, MSheikh, ELaLonde, JMYeh, SRPrendergast, GCMuller, AJ O-alkylhydroxylamines as rationally-designed mechanism-based inhibitors of indoleamine 2,3-dioxygenase-1. Eur J Med Chem 108:564-76 (2016)  
Target
Name:
Indoleamine 2,3-dioxygenase 1
Synonyms:
I23O1_HUMAN IDO-1 INDO Indoleamine 2,3-dioxygenase | Indoleamine-pyrrole 2,3-dioxygenase
Type:
Enzyme
Mol. Mass.:
45330.80
Organism:
Homo sapiens (Human)
Description:
P14902
Residue:
403
  
Inhibitor
Name:
BDBM50146460
Synonyms:
CHEMBL3763688
Type:
Small organic molecule
Emp. Form.:
C7H9ClINO
Mol. Mass.:
285.51
SMILES:
Cl.NOCc1ccc(I)cc1
: