Target
Sigma non-opioid intracellular receptor 1
Ligand
BDBM50146585
Substrate
Meas. Tech.
ChEMBL_1555061 (CHEMBL3767807)
Ki
5.2±n/a nM
Citation
 Abate, CRiganti, CPati, MLGhigo, DBerardi, FMavlyutov, TGuo, LWRuoho, A Development of sigma-1 (s1) receptor fluorescent ligands as versatile tools to studys1 receptors. Eur J Med Chem 108:577-85 (2016)  
Target
Name:
Sigma non-opioid intracellular receptor 1
Synonyms:
OPRS1 SIGMAR1 Sigma non-opioid intracellular receptor 1 Sigma1-receptor Sterol isomerase-like protein
Type:
Protein
Mol. Mass.:
25307.17
Organism:
Cavia porcellus (Guinea pig)
Description:
Q60492
Residue:
223
  
Inhibitor
Name:
BDBM50146585
Synonyms:
CHEMBL3763396
Type:
Small organic molecule
Emp. Form.:
C36H47N3O3
Mol. Mass.:
569.7767
SMILES:
CC1CCN(CCCCc2cccc3cc(OCCCCCCN4C(=O)c5ccc(cc5C4=O)N(C)C)ccc23)CC1
: