Target
Protein S100-B
Ligand
BDBM50100895
Substrate
Meas. Tech.
ChEMBL_1555503 (CHEMBL3768085)
IC50
66600±n/a nM
Citation
 Cavalier, MCAnsari, MIPierce, ADWilder, PTMcKnight, LERaman, EPNeau, DBBezawada, PAlasady, MJCharpentier, THVarney, KMToth, EAMacKerell, ADCoop, AWeber, DJ Small Molecule Inhibitors of Ca(2+)-S100B Reveal Two Protein Conformations. J Med Chem 59:592-608 (2016)  
Target
Name:
Protein S100-B
Synonyms:
Protein S100-B S-100 protein subunit beta S100B_RAT | S100b
Type:
PROTEIN
Mol. Mass.:
10731.34
Organism:
Rattus norvegicus
Description:
ChEMBL_116732
Residue:
92
  
Inhibitor
Name:
BDBM50100895
Synonyms:
2-(4-(4-carbamimidoylphenoxy)phenyl)-1H-indole-6-carboximidamide CHEMBL289577 | NSC-240898
Type:
Small organic molecule
Emp. Form.:
C22H19N5O
Mol. Mass.:
369.4192
SMILES:
NC(=N)c1ccc(Oc2ccc(cc2)-c2cc3ccc(cc3[nH]2)C(N)=N)cc1
: