Target
Carbonic anhydrase 2
Ligand
BDBM50147175
Substrate
Meas. Tech.
ChEMBL_1554386 (CHEMBL3767220)
Ki
877±n/a nM
Citation
 Eldehna, WMFares, MCeruso, MGhabbour, HAAbou-Seri, SMAbdel-Aziz, HAAbou El Ella, DASupuran, CT Amido/ureidosubstituted benzenesulfonamides-isatin conjugates as low nanomolar/subnanomolar inhibitors of the tumor-associated carbonic anhydrase isoform XII. Eur J Med Chem 110:259-66 (2016)  
Target
Name:
Carbonic anhydrase 2
Synonyms:
CA-II CAC Carbonate dehydratase II Carbonic anhydrase 2 (CA-II) Carbonic anhydrase C Carbonic anhydrase II (CA-II) Carbonic anhydrase II (hCA II) | Carbonic anhydrase isoenzyme II (hCA II)
Type:
Enzyme
Mol. Mass.:
29250.71
Organism:
Homo sapiens (Human)
Description:
P00918
Residue:
260
  
Inhibitor
Name:
BDBM50147175
Synonyms:
CHEMBL3763750
Type:
Small organic molecule
Emp. Form.:
C21H16N6O6S
Mol. Mass.:
480.453
SMILES:
NS(=O)(=O)c1ccc(NC(=O)Nc2ccc(cc2)\N=C2/C(=O)Nc3ccc(cc23)[N+]([O-])=O)cc1
: