Target
Carbonic anhydrase 9
Ligand
BDBM50147189
Substrate
Meas. Tech.
ChEMBL_1554387 (CHEMBL3767221)
Ki
8.5±n/a nM
Citation
 Eldehna, WMFares, MCeruso, MGhabbour, HAAbou-Seri, SMAbdel-Aziz, HAAbou El Ella, DASupuran, CT Amido/ureidosubstituted benzenesulfonamides-isatin conjugates as low nanomolar/subnanomolar inhibitors of the tumor-associated carbonic anhydrase isoform XII. Eur J Med Chem 110:259-66 (2016)  
Target
Name:
Carbonic anhydrase 9
Synonyms:
CA-IX CAH9_HUMAN Carbonic anhydrase 9 (CA IX) Carbonic anhydrase 9 precursor Carbonic anhydrase IX (CAIX) Carbonic anhydrases; II & IX MN RCC-associated antigen G250
Type:
Enzyme
Mol. Mass.:
49669.03
Organism:
Homo sapiens (Human)
Description:
Catalytic domain of human cloned isozyme was used in the assay
Residue:
459
  
Inhibitor
Name:
BDBM50147189
Synonyms:
CHEMBL3764810
Type:
Small organic molecule
Emp. Form.:
C22H19N5O5S
Mol. Mass.:
465.482
SMILES:
COc1ccc2NC(=O)\C(=N/c3ccc(NC(=O)Nc4ccc(cc4)S(N)(=O)=O)cc3)c2c1
: