Target
Carbonic anhydrase 12
Ligand
BDBM50147189
Substrate
Meas. Tech.
ChEMBL_1554388 (CHEMBL3767222)
Ki
1.6±n/a nM
Citation
 Eldehna, WMFares, MCeruso, MGhabbour, HAAbou-Seri, SMAbdel-Aziz, HAAbou El Ella, DASupuran, CT Amido/ureidosubstituted benzenesulfonamides-isatin conjugates as low nanomolar/subnanomolar inhibitors of the tumor-associated carbonic anhydrase isoform XII. Eur J Med Chem 110:259-66 (2016)  
Target
Name:
Carbonic anhydrase 12
Synonyms:
CA-XII CAH12_HUMAN Carbonic anhydrase Carbonic anhydrase XII Carbonic anhydrase XII (CAXII) | Tumor antigen HOM-RCC-3.1.3
Type:
Enzyme
Mol. Mass.:
39456.00
Organism:
Homo sapiens (Human)
Description:
Catalytic domain of human cloned isozyme was used in the assay
Residue:
354
  
Inhibitor
Name:
BDBM50147189
Synonyms:
CHEMBL3764810
Type:
Small organic molecule
Emp. Form.:
C22H19N5O5S
Mol. Mass.:
465.482
SMILES:
COc1ccc2NC(=O)\C(=N/c3ccc(NC(=O)Nc4ccc(cc4)S(N)(=O)=O)cc3)c2c1
: