Target
Diacylglycerol lipase-beta
Ligand
BDBM50148158
Substrate
Meas. Tech.
ChEMBL_1553507 (CHEMBL3768874)
IC50
40±n/a nM
Citation
 Chupak, LSZheng, XHu, SHuang, YDing, MLewis, MAWestphal, RSBlat, YMcClure, AGentles, RG Structure activity relationship studies on chemically non-reactive glycine sulfonamide inhibitors of diacylglycerol lipase. Bioorg Med Chem 24:1455-68 (2016)  
Target
Name:
Diacylglycerol lipase-beta
Synonyms:
DAGLB Sn1-specific diacylglycerol lipase beta
Type:
PROTEIN
Mol. Mass.:
73731.79
Organism:
Homo sapiens (Human)
Description:
ChEMBL_557688
Residue:
672
  
Inhibitor
Name:
BDBM50148158
Synonyms:
CHEMBL3764017
Type:
Small organic molecule
Emp. Form.:
C29H29Cl2NO5S
Mol. Mass.:
574.515
SMILES:
CC1(C)CCc2cc(ccc2O1)S(=O)(=O)N(CC(O)=O)C1(CCC1)c1cccc(c1)-c1cc(Cl)cc(Cl)c1
: