Target
Diacylglycerol lipase-alpha
Ligand
BDBM50148183
Substrate
Meas. Tech.
ChEMBL_1553309 (CHEMBL3767698)
IC50
60±n/a nM
Citation
 Chupak, LSZheng, XHu, SHuang, YDing, MLewis, MAWestphal, RSBlat, YMcClure, AGentles, RG Structure activity relationship studies on chemically non-reactive glycine sulfonamide inhibitors of diacylglycerol lipase. Bioorg Med Chem 24:1455-68 (2016)  
Target
Name:
Diacylglycerol lipase-alpha
Synonyms:
C11orf11 DGLA_HUMAN NSDDR | Sn1-specific diacylglycerol lipase alpha
Type:
PROTEIN
Mol. Mass.:
114947.74
Organism:
Homo sapiens (Human)
Description:
ChEMBL_1449471
Residue:
1042
  
Inhibitor
Name:
BDBM50148183
Synonyms:
CHEMBL3764377
Type:
Small organic molecule
Emp. Form.:
C23H18F5NO6S
Mol. Mass.:
531.449
SMILES:
OC(=O)CN(Cc1cccc(c1)-c1ccccc1OC(F)(F)F)S(=O)(=O)c1ccc(OC(F)F)cc1
: