Target
Pantothenate synthetase
Ligand
BDBM50147719
Substrate
Meas. Tech.
ChEMBL_1555395 (CHEMBL3766329)
IC50
1020±n/a nM
Citation
 Samala, GDevi, PBSaxena, SMeda, NYogeeswari, PSriram, D Design, synthesis and biological evaluation of imidazo[2,1-b]thiazole and benzo[d]imidazo[2,1-b]thiazole derivatives as Mycobacterium tuberculosis pantothenate synthetase inhibitors. Bioorg Med Chem 24:1298-307 (2016)  
Target
Name:
Pantothenate synthetase
Synonyms:
Chain A, Crystal Structure Of A Pantothenate Synthetase, Apo Enzyme In C2 Space Group Pantothenate synthetase | panC
Type:
Mol. Mass.:
32675.10
Organism:
Mycobacterium tuberculosis (strain ATCC 25618 / H37Rv)
Description:
ChEMBL_102878
Residue:
309
  
Inhibitor
Name:
BDBM50147719
Synonyms:
CHEMBL3763769
Type:
Small organic molecule
Emp. Form.:
C18H13BrN4OS
Mol. Mass.:
413.291
SMILES:
Cc1nc2sc3ccccc3n2c1C(=O)N\N=C\c1ccc(Br)cc1
: