Target
Pantothenate synthetase
Ligand
BDBM50147724
Substrate
Meas. Tech.
ChEMBL_1555395 (CHEMBL3766329)
IC50
690±n/a nM
Citation
 Samala, GDevi, PBSaxena, SMeda, NYogeeswari, PSriram, D Design, synthesis and biological evaluation of imidazo[2,1-b]thiazole and benzo[d]imidazo[2,1-b]thiazole derivatives as Mycobacterium tuberculosis pantothenate synthetase inhibitors. Bioorg Med Chem 24:1298-307 (2016)  
Target
Name:
Pantothenate synthetase
Synonyms:
Chain A, Crystal Structure Of A Pantothenate Synthetase, Apo Enzyme In C2 Space Group Pantothenate synthetase | panC
Type:
Mol. Mass.:
32675.10
Organism:
Mycobacterium tuberculosis (strain ATCC 25618 / H37Rv)
Description:
ChEMBL_102878
Residue:
309
  
Inhibitor
Name:
BDBM50147724
Synonyms:
CHEMBL3764280
Type:
Small organic molecule
Emp. Form.:
C13H10BrN3OS
Mol. Mass.:
336.207
SMILES:
Cc1nc2sccn2c1C(=O)Nc1ccc(Br)cc1
: